2017年2月9日在03:36

哥印拜陀英语口语培训



失败的 是广泛用于移动应用程序的自动化工具,本文 将帮助您使用Android Studio设置Appium,包括编写 然后使用Appium执行您的第一个测试用例。 android studio,那么这篇文章肯定会帮助您 设置Appium。我希望这篇文章可以帮助您设置Appium测试环境 迅速地。如果您遇到任何问题,请发表您的问题。让我们开始学习如何在Android Studio中安装Appium和进行配置。这是在Android Studio中设置Appium的非常简单的分步教程。





  1. 布什拉88
    1. 安卓 Studio
    2. 2016年2月15日在16:14
    3. 钦奈的硒培训
    4. 约格什·坦维(Yogesh Thanvi) 
    5. 请帮忙!
  2. 安装Android Studio请按照链接中给出的步骤在Windows机器上逐步安装android studio 阿努贾·贾恩(Anuja Jain)
  3. 安装android studio后,请打开android studio并创建一个新项目- 钦奈Salesforce培训
4. 将下载的Appium罐子添加到您的项目中-点击项目-> click on app->复制lib中的所有jar。选择复制的罐子,除了 Selenium,Java客户端和Junit Jar,然后右键单击它,然后单击 "添加为库".

5.在应用程序中单击build.gradle,您将看到所有添加的库,如下面的屏幕快照所示添加junit:4.12.Sync项目或重新生成项目。它应该显示“建立成功的消息”

2018年1月31日在01:45


6. 现在您可以编写第一个测试用例了-右键单击 包,然后单击“创建Java类”。复制给定的测试用例样本。

2018年2月13日22:00

  • 组合芽庄市giárẻ
  • | Blogger主题作者
  • 开始 具有特定端口“ 4444”的appium服务器阿努贾·贾恩(Anuja Jain)
  • 使用USB调试连接设备或启动仿真器。
  • 右键单击测试类,然后单击“运行”
 

import java.net.MalformedURLException;
import java.net.MalformedURLException;
import java.net.URL;
import java.util.concurrent.TimeUnit;

2016年8月16日在01:21
2017年2月9日在02:26
金奈的javascript培训
使用Android Studio设置Appium
导入org.openqa.selenium.remote.CapabilityType;
导入org.openqa.selenium.remote.DesiredCapabilities;
导入org.openqa.selenium.remote.RemoteWebDriver;
导入org.openqa.selenium.support.ui.ExpectedConditions;
导入org.openqa.selenium.support.ui.WebDriverWait;



public class WaitTests {

 WebDriver driver;

 @Before
 公共无效setUp()抛出MalformedURLException {
  // DesiredCapabilities类的创建对象。
  DesiredCapabilities功能=新的DesiredCapabilities();

  // Set android deviceName desired capability. Set your device name.
  abilities.setCapability("设备名称", "XT1562");

  //设置所需的BROWSER_NAME功能。它'在这里以Android为例。
  abilities.setCapability(CapabilityType.BROWSER_NAME, "安卓");

  //设置android VERSION所需的功能。设定您的行动装置's OS version.
  abilities.setCapability(CapabilityType.VERSION, "6.0.1");

  //设置android platformName所需的功能。它'在这里以Android为例。
  abilities.setCapability("platformName", "安卓");

  //设置android appPackage所需的功能。它是
  // com.android.calculator2用于计算器应用程序。
  //设置您的应用's appPackage(如果您使用任何其他应用程序)。
  abilities.setCapability("appPackage", "com.android.calculator2");

  //设置android appActivity所需的功能。它是
  //用于计算器应用程序的com.android.calculator2.Calculator。
  //设置您的应用's appPackage(如果您使用任何其他应用程序)。
  abilities.setCapability("appActivity", "com.android.calculator2.Calculator");

  // RemoteWebDriver的创建对象将全部设置功能。
  //在URL字符串中设置appium服务器地址和端口号。
  //它将在android设备中启动计算器应用。
  driver = new RemoteWebDriver(new URL("http://127.0.0.1:4723/wd/hub"), capabilities);
  driver.manage()。timeouts()。implicitlyWait(15,TimeUnit.SECONDS);
  
  
 }

 @Test
 您好,您对此有任何解决方案吗?
  
 
  //在运行测试之前,单击DELETE / CLR按钮以清除结果文本框。
  driver.findElements(By.xpath("//android.widget.Button")).get(0).click();

  Google Cloud在线培训
  driver.findElement(By.name("7"))。点击();

 driver.manage()。timeouts()。implicitlyWait(30,TimeUnit.SECONDS); 
}

@After
 public void End() {
  driver.quit();
 }
}

 
 
Once your Setup is Complete Learn more About Appium with this simple Step by Step
APPIUM TUTORIAL 
Note - Learn More About Android Studio Basic Features and Functionality HERE .
 
If you want to learn more about Testing with Emulators and Real Devices do refer this article -

Real Device vs Emulator Testing Ultimate Showdown

Please share your feedback in comments section below and join QA-Automated 
for latest post updates.Happy Testing !!!



失败的服务器

  1. 屏幕镜像应用
    将Appium罐子添加到您的项目中-单击项目-> click on app->复制lib中的所有jar。选择复制的罐(Selenium,Java客户端和Junit Jar除外),然后右键单击它,然后单击"Add as Library".

    但是我看不到"lib"Android Studio中的文件夹'的项目资源管理器,尽管我在Windows文件夹结构中看到了。

    而且我在任何上下文菜单中都没有看到“添加为库”选项,我们是否只需要复制粘贴所有jar文件到Windows资源管理器中的lib文件夹中?

    页数穆拉利
    Arshiya
    1. 点击项目结构,然后在左上角有一个下拉菜单->检查是否选择了android,然后更改并选择"project" -> then click on app->libs,然后您可以右键单击libs并复制jar文件。

      穆拉利
    2. 印度

      单击“项目结构”时,单击“项目”时,会得到这些下拉菜单。我可以使用更新的Android Studio版本,然后呢?

      我无法上传jar文件,而是通过应用程序将其添加了->通过Maven的依赖。这仍然足以运行上面的测试代码吗?当我通过src创建测试类时-> main ->java什么都无法解决。

      你能解决这个吗?

      穆拉利
    3. 在项目结构的搜索lib文件夹中,在该文件中以及gradle依赖项中添加文件,然后只有您才能看到结果。

      穆拉利
    4. 在android studio的左侧严格选择项目。您将看到lib文件夹

      穆拉利
    5. 热门帖子 导入org.junit.Test;

      2020年10月27日在21:39

      马杜赖德语班

      2020年10月27日在21:39

      项目s for cse

      Angular培训涵盖了广泛的主题,包括组件,Angular指令,Angular服务,管道,安全基础知识,路由和Angular可编程性。新的Angular TRaining将奠定您专门研究Single Page Application开发人员所需的基础。 版本名

      穆拉利
  2. 有什么帮助吗?自动化测试博客

    当我复制上面的代码时,在下面提到的行中出现错误。让我们知道使用的接口,以便更好地理解。谢谢!

    页数穆拉利
  3. 有什么帮助吗?钦奈的Pega培训

    |发行人
    reader.readFile();

    页数穆拉利
  4. Remove these two lines as these I added to start Appium server using java code . This tutorial is also there ar my blog -http://qaautomated.blogspot.in/2016/01/how-to-start-appium-server-using-java.html

    页数穆拉利
  5. 有什么帮助吗?2017年11月1日18:11

    由...设计

    我应该在课堂上导入哪些软件包?

    页数穆拉利
  6. 2016年8月16日在01:21
    magento开发培训
    2017年2月9日在02:26
    德里至斋浦尔一日游
    2017年3月28日在05:44
    失败的设置的Build.gradle代码

    导入org.openqa.selenium.remote.DesiredCapabilities;
    它并经常检查回来!
    导入java.net.URL;
    导入io.appium.java_client.AppiumDriver;
    导入io.appium.java_client.MobileElement;
    导入io.appium.java_client.remote.MobileCapabilityType;

    页数穆拉利
  7. 感谢您的教程,在您的源代码中,是否需要将sample.apk放在c:// apk //,
    没有文件't have the file "sample.apk".
    期待您的答复。谢谢你。

    页数穆拉利
  8. 2018年5月26日在06:27
    您需要放置要测试的apk的路径

    页数穆拉利
  9. 我在收到一个未解决的符号错误"驱动程序=新的AndroidDriver ...."我做了一些挖掘,似乎AndroidDriver是org.openqa.selenium的一部分,但它没有出现在我的org.openqa.selenium包中。

    页数穆拉利
    Arshiya
    1. 有什么帮助吗?维南湾

      安卓Driver is the unresolved symbol.

      穆拉利
    2. 检查是否添加了java-client-3.2.0.jar,可以从我在文章中给出的链接中下载。因为AndroidDriver是此软件包的一部分
      导入io.appium.java_client.android.AndroidDriver;

      穆拉利
  10. 你能说说如何解决这个问题吗
    测试运行失败:由于以下原因,仪表运行失败'java.lang.ClassNotFoundException'
    屏幕镜像应用
    尼梅什·沙
    回覆

    页数穆拉利
  11. 可能有不同的原因导致此错误-
    1.在scr-中创建测试用例> main-> java
    RPA面试问题的新生
    3.如果您在真实设备中运行,请检查USB调试是否已打开并已作为文件传输连接

    页数穆拉利
  12. 由...设计

    您能否让我知道我们可以为此配置TestNG吗?
    如果是,请提供执行此操作的步骤。

    较早的帖子
    番石榴23.0

    页数穆拉利
    Arshiya
    1. 嗨Anuja,
      We can configure TestNG for this and I have addes a blog post so that you can do it . please check out this link - http://qaautomated.blogspot.in/2016/03/appium-setup-in-android-studio-with.html
      拉桑塔
      穆什克

      穆拉利
  13. 有什么帮助吗?出现波纹管错误,

    由...设计
    下载部分的第二个链接是Google驱动器中的Appium jar文件-这些文件是从哪里下载的?

    页数穆拉利
  14. 由...设计
    如何解决这些错误。
    维南湾(VémáyBaytừphápvềviệtnam)
    Chennai的bigdata和hadoop培训
    质量检查自动化-Atom
    周杰伦

    页数穆拉利
  15. 由...设计
    如何解决这些错误。
    维南湾(VémáyBaytừphápvềviệtnam)
    Chennai的bigdata和hadoop培训
    质量检查自动化-Atom
    周杰伦

    页数穆拉利
    Arshiya
    1. 您好sravanthi,您可以单击错误并导入所需的类。如果未导入,请检查依赖项和库

      穆拉利
    2. 我试过了,但是进口也没有用
      CSE项目
      driver=new AndroidDriver("http://127.0.0.1:4444/wd/hub",cap);(e:connot resolve constructor)
      driver.findElementByID("Example").click();(e.cannot resolve method findElementByID) Asser.assertTrue(driver.findElementByID("Example").isDisplayed));
      钦奈DevOps认证

      穆拉利
    3. 有什么帮助吗?2016年4月6日06:23

      嗨,我有同样的问题...对此有什么解决方案?提前致谢。

      穆拉利
    4. 是的,我有同样的问题。如果您有解决方案。请告诉我

      穆拉利
    5. 如果您的导入不起作用,请检查lib文件夹和build.gradle中的ur jar。如果缺少任何东西,您将不会获得进口

      穆拉利
    6. 有什么帮助吗?2017年3月8日12:16

      嗨,Anuja,谢谢您的教程,但我'我得到同样的错误。

      我已经导入了库并编译了gradle,但是什么也没有,我总是得到与Sravanthi M相同的错误

      穆拉利
    7. 有什么帮助吗?2017年8月29日在23:38

      driver = new AndroidDriver(cap);(构造函数只有一个参数DesiredCapabilities)
      driver.findElementById("Example").click();(Change method name findElementByID() to findElementById) Assert.assertTrue(driver.findElementById("Example").isDisplayed));
      (没有名为Asser的sysmbol,将其更改为Assert)

      穆拉利
    8. 有什么帮助吗?2017年12月11日在08:12

      班加罗尔的最佳DevOps培训

      穆拉利
  16. I'自最近四个小时以来,我无法解决此错误。请指导将其删除

    I'2016年2月11日在06:54

    爪哇.lang.NoSuchFieldError: INSTANCE
    在org.apache.http.conn.ssl.SSLConnectionSocketFactory。(SSLConnectionSocketFactory.java:144)
    在org.openqa.selenium.remote.internal.HttpClientFactory.getClientConnectionManager(HttpClientFactory.java:71)
    在org.openqa.selenium.remote.internal.HttpClientFactory。(HttpClientFactory.java:57)
    在org.openqa.selenium.remote.internal.HttpClientFactory。(HttpClientFactory.java:60)
    在org.openqa.selenium.remote.internal.ApacheHttpClient $ Factory.getDefaultHttpClientFactory(ApacheHttpClient.java:251)
    在org.openqa.selenium.remote.internal.ApacheHttpClient $ Factory。(ApacheHttpClient.java:228)
    在org.openqa.selenium.remote.HttpCommandExecutor.getDefaultClientFactory(HttpCommandExecutor.java:89)
    在org.openqa.selenium.remote.HttpCommandExecutor。(HttpCommandExecutor.java:63)
    位于io.appium.java_client.remote.AppiumCommandExecutor。(AppiumCommandExecutor.java:36)
    在io.appium.java_client.AppiumDriver。(AppiumDriver.java:167)
    在io.appium.java_client.android.AndroidDriver。(AndroidDriver.java:69)
    在appiumtest.cogitate.us.appiumtest.ExampleUnitTest.testCaseSetup处(ExampleUnitTest.java:37)

    嗨,这解决了我的错误。谢谢

    页数穆拉利
    Arshiya
    1. 您是否有针对此错误的解决方案?我遇到了同样的错误。

      穆拉利
  17. 我们是否需要单独的android sdk或android studio才能达到目的。
    因为使用Android Studio在ubuntu上运行我的第一个appium测试用例时,没有设置android_home错误。

    页数穆拉利
    Arshiya
    1. android studio就足够了,您可以在android studio中使用sdk管理器下载android sdk。您需要设置Android_Home才能使用android studio执行任何操作

      穆拉利
  18. 有什么帮助吗?编译版本28

    感谢您的文章。我们是否有一些构建相关性文件来包含Appium Jar文件和Appium Client Library-而不是手动下载它们?

    页数穆拉利
    Arshiya
    1. 我不认为这样我们就可以了。我仍然会尝试了解更多信息。如果您有发现,请与我们分享。

      穆拉利
  19. 有什么帮助吗?2016年5月28日在09:44

    这是一个伟大的倡议。感谢您的文章和回答问题。
    您是否可以创建该项目并签入GitHub,以便其他用户可以将其导入Android Studio。这样,大多数人都能成功,快速,轻松地在Android Studio中获取Appuim环境。另外,将来有人甚至可以修复/更新GitHub-以使其保持最新状态。

    页数穆拉利
    Arshiya
    1. 感谢您的评论,我会尽力做到这一点:-)

      穆拉利
  20. 有什么帮助吗?2017年4月13日在04:07

    内存

    如何从驱动器复制所有jar文件?我是这种自动化的新手,请帮帮我。

    页数穆拉利
    Arshiya
    1. 嗨,只需从驱动器下载jar文件。然后全选并复制。然后转到android studio项目-> app>lib文件夹并粘贴所有文件。
      拉桑塔
      穆什克

      穆拉利
  21. Arshiya
    1. 188条评论> build.gradle
      * 什么地方出了错:
      exclude 'META-INF /依赖.txt'
      exclude 'META-INF/LICENSE.txt'
      exclude 'META-INF/NOTICE.txt'
      exclude 'META-INF/NOTICE'
      exclude 'META-INF/LICENSE'
      exclude 'META-INF /依赖'
      exclude 'META-INF/notice.txt'
      exclude 'META-INF/license.txt'
      exclude 'Oracle企业管理器培训'
      exclude 'META-INF/LGPL2.1'
      }

      穆拉利
  22. 内存
    I'应对所有jar文件并正确导入,即使出现错误也是如此。
    driver=new AndroidDriver("http://127.0.0.1:4444/wd/hub",cap); error as Cannot resolve constructor 'AndroidDriver(java.lang.String, org.openqa.selenium.remote.DesiredCapabilities)'

    断言'Asser' ...

    如果您能帮助我,将不胜感激

    干杯
    感谢你

    页数穆拉利
    Arshiya
    1. 您可以检查是否已导入所需的软件包-
      2016年8月16日在01:21
      magento开发培训
      2017年2月9日在02:26
      德里至斋浦尔一日游
      2017年3月28日在05:44
      失败的设置的Build.gradle代码

      导入org.openqa.selenium.remote.DesiredCapabilities;
      它并经常检查回来!
      导入java.net.URL;
      导入io.appium.java_client.AppiumDriver;
      导入io.appium.java_client.MobileElement;
      导入io.appium.java_client.remote.MobileCapabilityType;

      穆拉利
    2. I also had the same issue and I found that using it like this can solve the issue - driver=new AndroidDriver (new URL("http://127.0.0.1:4444/wd/hub"), cap);

      穆拉利
    3. 注意"import java.net.URL;" would be needed.

      穆拉利
  23. 有什么帮助吗?2016年11月3日在08:26

    该评论已被博客管理员删除。

    页数穆拉利
  24. 我无法更改构建变体,并且出现java.lang.NoClassDefFoundError:com / sun / jna / platform / win32 / Kernel32错误。

    I have posted a question on stackoverflow here http://stackoverflow.com/questions/40396108/calling-stop-on-appiumdriverlocalservice-fails.

    当我尝试停止服务器时会发生这种情况。

    页数穆拉利
    Arshiya
    1. 您可以与我共享build.gradle依赖项部分。这样我可以更清楚一些。

      穆拉利
  25. 有什么帮助吗?2016年10月11日在12:39

    2016年8月10日在10:43

    driver = new RemoteWebDriver(new URL("http://127.0.0.1:4723/wd/hub"), (Capabilities) capabilities);

    网页开发

    爪哇.lang.ClassCastException:org.openqa.selenium.remote.DesiredCapabilities无法转换为org.openqa.selenium.Capabilities

    你好呀,

    页数穆拉利
  26. 感谢您的精美教程。我发现本教程很晚,但是BINGO :)。但它'用漂亮的解释清楚我的概念

    页数穆拉利
    Arshiya
    1. 我很高兴它对您有所帮助。感谢您的访问。在FB或G +上关注我,以获取最新的帖子更新。 :-)

      穆拉利
  27. 请,请帮助我,如果我们怎么做!


    信息:[调试]错误:'java -version'失败的。错误:产生ENOENT
    >在[object Object]。 (C:\ Program Files \ Appium \ node_modules \ appium \ lib \ devices \ android \ android-common.js:1057:17)
    >在exithandler(child_process.js:633:7)
    >在ChildProcess.errorhandler(child_process.js:649:5)
    >在ChildProcess.EventEmitter.emit(events.js:95:17)
    >在Process.ChildProcess._handle.onexit(child_process.js:795:12)
    >信息:[调试]响应错误,客户端:{"status":33,"value":{"message":"无法创建新的会话。 (原始错误:'java -version'失败的。错误:产生ENOENT)","origValue":"'java -version'失败的。错误:产生ENOENT"},"sessionId":null}
    > info: <-POST / wd / hub / session 500 33.932毫秒-208

    页数穆拉利
  28. 哇,有关Android Studio上Appium的简明有效教程。它挽救了我的一天。

    你好Anuja,

    页数穆拉利
    Arshiya
    1. 嘿,谢谢您停在我的博客上。我很高兴它挽救了您的生活。保持联系以获取更多教程

      穆拉利
  29. 他感谢您在我的博客停留。我很高兴它挽救了您的生活。保持联系以获取更多教程

    页数穆拉利

  30. 请从另一个帐户上传视频,这真的很有帮助。

    页数穆拉利
    Arshiya
    1. 内存
      我已决定等待1天,因为我没有违反任何条款,否则将会从其他帐户更新。

      拉桑塔
      穆什克

      穆拉利
  31. 此评论已被作者删除。

    页数穆拉利
  32. 关于我
    我还有一个查询,如何在android中自动执行Toast消息?请提出建议。

    页数穆拉利
  33. 在sun.reflect.NativeConstructorAccessorImpl.newInstance0(本机方法)处
    在sun.reflect.NativeConstructorAccessorImpl.newInstance(NativeConstructorAccessorImpl.java:62)
    在sun.reflect.DelegatingConstructorAccessorImpl.newInstance(DelegatingConstructorAccessorImpl.java:45)
    在java.lang.reflect.Constructor.newInstance(Constructor.java:423)
    在org.openqa.selenium.remote.ErrorHandler.createThrowable(ErrorHandler.java:216)
    在org.openqa.selenium.remote.ErrorHandler.throwIfResponseFailed(ErrorHandler.java:168)

    页数穆拉利
  34. org.openqa.selenium .SessionNotCreatedException: 无法创建新的会话。 (原始错误:Requested a new session but one was in progress) (WARNING: The server did not provide any stacktrace information)
    命令持续时间或超时:0毫秒
    生成信息:版本:'unknown', revision: '86a5d70', time: '2017-02-16 07:47:51 -0800'
    系统信息:主机:'LENOVO-PC', ip: '192.168.0.106', os.name: 'Windows 7', os.arch: 'amd64', os.version: '6.1', java.version: '1.8.0_76-release'
    驱动程序信息:driver.version:RemoteWebDriver

    页数穆拉利
  35. 在org.openqa.selenium.remote.ProtocolHandshake.createSession(ProtocolHandshake.java:161)
    在org.openqa.selenium.remote.ProtocolHandshake.createSession(ProtocolHandshake.java:64)
    在org.openqa.selenium.remote.HttpCommandExecutor.execute(HttpCommandExecutor.java:141)
    在org.openqa.selenium.remote.RemoteWebDriver.execute(RemoteWebDriver.java:601)
    在org.openqa.selenium.remote.RemoteWebDriver.startSession(RemoteWebDriver.java:241)
    在org.openqa.selenium.remote.RemoteWebDriver。(RemoteWebDriver.java:128)
    在org.openqa.selenium.remote.RemoteWebDriver。(RemoteWebDriver.java:155)
    在com.example.lenovo.android.Cbsk.setUp(Cbsk.java:55)
    在sun.reflect.NativeMethodAccessorImpl.invoke0(本机方法)处
    在sun.reflect.NativeMethodAccessorImpl.invoke(NativeMethodAccessorImpl.java:62)
    在sun.reflect.DelegatingMethodAccessorImpl.invoke(DelegatingMethodAccessorImpl.java:43)
    在java.lang.reflect.Method.invoke(Method.java:498)
    在org.junit.runners.model.FrameworkMethod $ 1.runReflectiveCall(FrameworkMethod.java:50)
    在org.junit.internal.runners.model.ReflectiveCallable.run(ReflectiveCallable.java:12)
    在org.junit.runners.model.FrameworkMethod.invokeExplosively(FrameworkMethod.java:47)
    在org.junit.internal.runners.statements.RunBefores.evaluate(RunBefores.java:24)
    在org.junit.internal.runners.statements.RunAfters.evaluate(RunAfters.java:27)
    在org.junit.runners.ParentRunner.runLeaf(ParentRunner.java:325)
    在org.junit.runners.BlockJUnit4ClassRunner.runChild(BlockJUnit4ClassRunner.java:78)
    在org.junit.runners.BlockJUnit4ClassRunner.runChild(BlockJUnit4ClassRunner.java:57)
    在org.junit.runners.ParentRunner $ 3.run(ParentRunner.java:290)
    在org.junit.runners.ParentRunner $ 1.schedule(ParentRunner.java:71)
    在org.junit.runners.ParentRunner.runChildren(ParentRunner.java:288)
    在org.junit.runners.ParentRunner.access $ 000(ParentRunner.java:58)
    在org.junit.runners.ParentRunner上$ 2.evaluate(ParentRunner.java:268)
    在org.junit.runners.ParentRunner.run(ParentRunner.java:363)
    在org.junit.runner.JUnitCore.run(JUnitCore.java:137)
    在com.intellij.junit4.JUnit4IdeaTestRunner.startRunnerWithArgs(JUnit4IdeaTestRunner.java:119)
    在com.intellij.junit4.JUnit4IdeaTestRunner.startRunnerWithArgs(JUnit4IdeaTestRunner.java:42)
    在com.intellij.rt.execution.junit.JUnitStarter.prepareStreamsAndStart(JUnitStarter.java:234)
    在com.intellij.rt.execution.junit.JUnitStarter.main(JUnitStarter.java:74)
    在sun.reflect.NativeMethodAccessorImpl.invoke0(本机方法)处
    在sun.reflect.NativeMethodAccessorImpl.invoke(NativeMethodAccessorImpl.java:62)
    在sun.reflect.DelegatingMethodAccessorImpl.invoke(DelegatingMethodAccessorImpl.java:43)
    在java.lang.reflect.Method.invoke(Method.java:498)
    在com.intellij.rt.execution.application.AppMain.main(AppMain.java:144)

    页数穆拉利
  36. vémáybaytừhảiphòngđihànquốc

    页数穆拉利
    Arshiya
    1. 嗨,您能尝试在其他端口号上启动的Appium服务器吗?
      确保您具有最新的appium服务器和appium java客户端。

      拉桑塔
      穆什克

      穆拉利
    2. 我也有同样的问题!解决了!谢谢 :))))))

      穆拉利
  37. 有什么帮助吗?2016年6月25日在00:32

    嗨,我在android studi中创建一个项目时遇到了一些问题,gradle显示了此错误:
    错误:(41,17)无法解决:junit:junit:4.12
    错误:无法解决:com.squareup:javawriter:2.1.1
    错误:无法解决:javax.inject:javax.inject:1
    错误:无法解决:javax.annotation:javax.annotation-api:1.2
    错误:无法解决:com.google.code.findbugs:jsr305:2.0.1
    错误:无法解决:org.hamcrest:hamcrest-library:1.3
    错误:无法解决:com.squareup:javawriter:2.1.1

    请我按照您教程的每个步骤进行操作。我需要帮助...谢谢

    页数穆拉利
    Arshiya
    1. 您好,请确保您拥有最新版本的appium客户端和服务器以及硒罐。另外,您还安装了最新版本的JAVA和Android Studio。您也可以观看视频,以遵循确切的步骤。
      @前
      穆什克

      穆拉利
  38. 有什么帮助吗?2017年3月1日在02:41

    内存
    钦奈德语班
    我按照您提到的所有步骤操作,并导入了您在视频和博客中提到的所有jar,
    但是,在粘贴代码时,无法识别以下导入-

    金奈的javascript培训
    导入org.openqa.selenium.remote.CapabilityType;
    导入org.openqa.selenium.remote.DesiredCapabilities;
    导入org.openqa.selenium.remote.RemoteWebDriver;
    导入org.openqa.selenium.support.ui.ExpectedConditions;
    导入org.openqa.selenium.support.ui.WebDriverWait;

    (按,remtoe和support用红色显示)。
    结果,DesiredCapabilities可以'无法解决,代码没有't compile...

    您对我做错了什么建议吗?

    页数穆拉利
    Arshiya
    1. 嗨,当您提取硒罐时,文件夹中有一个ouside。你想念那个罐子。这就是为什么您会收到该错误的原因。

      穆拉利
    2. 有什么帮助吗?2016年3月2日在05:17

      移动应用开发课程

      穆拉利
    3. 浦那全栈开发人员课程

      您能否与我分享您的电子邮件,以便我分享该特定错误的屏幕截图。因为我是自动化的新手,所以我'我花了很多时间在配置上后感到沮丧,现在这些错误来了:(

      请帮我解决这个问题

      穆拉利
  39. 嗨,您的教程很好,但是我有一个问题,当我运行项目时,显示以下错误
    Error:执行任务失败'
    :app:transformResourcesWithMergeJavaResForDebug'.
    >com.android.build.api.transform.TransformException:
    com.android.builder.packaging.DuplicateFileException:
    在APK META-INF / LICENSE File1中复制的重复文件:
    C:\ Users \ Jolta \ AndroidStudioProjects \ MytestingApp \ app \ libs \ httpmime-4.5.2.jar File2:
    C:\ Users \ Jolta \ AndroidStudioProjects \ MytestingApp \ app \ libs \ xercesImpl-2.11.0.jar File3:
    C:\ Users \ Jolta \ AndroidStudioProjects \ MytestingApp \ app \ libs \ httpclient-4.5.2.jar File4:
    C:\ Users \ Jolta \ AndroidStudioProjects \ MytestingApp \ app \ libs \ cglib-nodep-3.2.4.jar File5:
    C:\ Users \ Jolta \ AndroidStudioProjects \ MytestingApp \ app \ libs \ httpcore-4.4.4.jar

    页数穆拉利
  40. 有什么帮助吗?2017年4月13日在04:25

    谢谢您的指导,对我有很大帮助。我对运动测试主题是陌生的,但我有一个疑问:我如何生成要测试的应用程序的代码?也就是说,参考书目几乎总是给我提供示例代码,但他们没有告诉我它们在哪里生成测试代码?
    我想知道这一点,请帮助我。

    页数穆拉利
  41. 有什么帮助吗?2016年4月27日07:14

    我开始测试´去年,Visual Studio,Microsoft测试经理和用于Web和桌面应用程序的Selenium成为了世界,我喜欢它。
    目前,我对自动移动测试感兴趣,并且我正在与appium和android studio合作。我已经完成了测试示例的工作,但是我不明白如何生成要测试的应用程序的代码?这些示例随您的代码一起提供。
    我在Mac上看到了Appium的示例,并且看到了它是如何生成代码的。
    我没有在Windows上看到过测试示例,它解释了appium和android studio的生成测试代码。
    排除

    页数穆拉利
  42. 由...设计

    在线移动应用开发

    调试] [MJSONWP]错误的参数:BadParametersError:参数不正确。我们要 {"required":["desiredCapabilities"],"optional":["requiredCapabilities","sessionId","id","sessionId","id"]} and you sent ["desiredCapabilities","requiredCapabilities","capabilities","alwaysMatch","firstMatch"]





    你好,

    页数穆拉利
    Arshiya
    1. 班加罗尔的Salesforce培训
      拉桑塔
      穆什克

      穆拉利
  43. 有什么帮助吗?Adyar中的Java培训

    由...设计
    首先,非常感谢这个出色的教程,它确实帮助我入门(否则,过去两天来很多博客都使我陷入困境,但没有一个帮助)。

    我已经按照您的教程并在CentO上设置了环境-
    公共无效End(){
    (1)在初始化驱动程序时出现NullPointer异常
    "driver = new RemoteWebDriver(new URL("http://0.0.0.0:4723/wd/hub"), capabilities);"

    当我启动本地的appium服务器时-我看到了->
    给Blogger的最新提示
    [Appium] Appium REST http接口侦听器从0.0.0.0:4723开始。
    任何服务器如何开始于0.0.0.0:4723?

    (2)异常后,我在服务器上看到以下输出->
    [MJSONWP]错误的参数:BadParametersError:参数不正确。我们要 {"required":["desiredCapabilities"],"optional":["requiredCapabilities","capabilities","sessionId","id"]} and you sent ["desiredCapabilities","requiredCapabilities","capabilities","alwaysMatch","firstMatch"]
    [HTTP]<-POST / wd / hub / session 400 5毫秒-243
    -->POST / wd / hub / session {"desiredCapabilities":{"appPackage":"com.android.calculator2","appActivity":"com.android.calculator2.Calculator","browserName":"Android","platformName":"Android","deviceName":"SM-T230NU","version":"4.4.2"},"requiredCapabilities":{},"capabilities":{"desiredCapabilities":{"appPackage":"com.android.calculator2","appActivity":"com.android.calculator2.Calculator","browserName":"Android","platformName":"Android","deviceName":"SM-T230NU","version":"4.4.2"},"requiredCapabilities":{}},"alwaysMatch":{"appPackage":"com.android.calculator2","appActivity":"com.android.calculator2.Calculator","browserName":"Android","platformName":"Android","deviceName":"SM-T230NU","version":"4.4.2"},"firstMatch":[]}

    2016年3月1日23:23

    我正在尝试按照您在视频中描述的确切步骤进行操作。
    |供电

    页数穆拉利
  44. 海得拉巴Salesforce培训

    钦奈的Go Lang培训

    这行下面

    错误:将字节码转换为dex时出错:
    原因:Dex无法解析版本52字节代码。
    这是由使用Java 8或更高版本编译的库依赖关系引起的。
    如果您使用的是'java'gradle插件在库子模块中添加
    德里一日游套票'1.7'
    钦奈的Python培训'1.7'
    的build.gradle文件。's build.gradle file.

    页数穆拉利
  45. })
    当我s add the jars to lib in the project i get below error:
    如何创建Android项目?
    摇篮'的依赖项缓存可能已损坏(这有时会在网络连接超时后发生。)
    重新下载依赖项并同步项目(需要网络)

    字节伙伴1.7.5

    页数穆拉利
  46. 有什么帮助吗?2017年3月26日19:38

    嗨,我得到的FirstTest类名称显示为灰色,它表示从未使用Class FirstTest。我按照您的步骤进行操作,还看到导入org.openqa.selenium.remote.CapabilityType;
    导入org.openqa.selenium.remote.DesiredCapabilities;
    导入org.openqa.selenium.remote.RemoteWebDriver;
    导入org.openqa.selenium.support.ui.ExpectedConditions;
    导入org.openqa.selenium.support.ui.WebDriverWait;

    页数穆拉利
    Arshiya
    1. 内存

      这不是实际的错误,它只是有关该类的额外信息,不会影响执行

      拉桑塔
      穆什克

      穆拉利
  47. 有什么帮助吗?2018年3月14日20:17

    我的课程没有执行,因为它是灰色的。

    页数穆拉利
    Arshiya
    1. 内存

      确保正确使用了Junit批注。
      您已在src-中创建了clss>java -> this path..
      退出的另一种方法是选择测试用例名称,然后右键单击并运行。

      错误:
      穆什克

      穆拉利
  48. 有什么帮助吗?2017年4月13日在02:40

    嗨,这是正确的,它在/ test / java / FirstTest下

    页数穆拉利
  49. 有什么帮助吗?2016年3月14日,7:09

    由...设计
    这是一个很棒的教程,我能够一步一步地学习,但是现在遇到了这个错误。
    [HTTP]->POST / wd / hub / session {"desiredCapabilities":{"appPackage":"com.android.calculator","appActivity":"com.android.calculator.Calculator","browserName":"Android","platformName":"Android","deviceName":"9039262e","version":"6.0.1"},"requiredCapabilities":{},"capabilities":{"desiredCapabilities":{"appPackage":"com.android.calculator","appActivity":"com.android.calculator.Calculator","browserName":"Android","platformName":"Android","deviceName":"9039262e","version":"6.0.1"},"requiredCapabilities":{}},"alwaysMatch":{"appPackage":"com.android.calculator","appActivity":"com.android.calculator.Calculator","browserName":"Android","platformName":"Android","deviceName":"9039262e","version":"6.0.1"},"firstMatch":[]}
    [调试] [MJSONWP]错误的参数:BadParametersError:参数不正确。我们要 {"required":["desiredCapabilities"],"optional":["requiredCapabilities","capabilities","sessionId","id","sessionId","id","sessionId","id"]} and you sent ["desiredCapabilities","requiredCapabilities","capabilities","alwaysMatch","firstMatch"]
    driver.quit();

    页数穆拉利
  50. 非常感谢您。.您的博客真的很有帮助。继续...

    页数穆拉利
  51. 我在Mac OS中配置appium和android studio时遇到问题。因此,是否有可能共享Mac OS的任何视频。并且请简要说明如何在mac os中进行配置。

    页数穆拉利
  52. 有什么帮助吗?2017年4月24日12:03








    :app:transformClassesWithDexForDebug
    AGPBI:{"kind":"error","text":"将字节码转换为dex时出错:\ n原因:Dex无法解析版本52字节的代码。\ n这是由使用Java 8或更高版本编译的库依赖项引起的。\ n如果您在库子模块中使用\ u0027java \ u0027 gradle插件将\ ntargetCompatibility \ u003d \ u00271.7 \ u0027 \ nsourceCompatibility \ u003d \ u00271.7 \ u0027 \ n添加到该子模块\ u0027的build.gradle文件中。","sources":[{}],"original":"意外的最高级别异常:\ njava.lang.RuntimeException:异常解析类\ n \ tat com.android.dx.command.dexer.Main.processClass(Main.java:781)\ n \ tat com.android.dx。 command.dexer.Main.processFileBytes(Main.java:747)\ n \ tat com.android.dx.command.dexer.Main.access $ 1200(Main.java:88)\ n \ tat com.android.dx.command .dexer.Main $ FileBytesConsumer.processFileBytes(Main.java:1689)\ n \ tat com.android.dx.cf.direct.ClassPathOpener.processArchive(ClassPathOpener.java:284)\ n \ tat com.android.dx.cf .direct.ClassPathOpener.processOne(ClassPathOpener.java:166)\ n \ tat com.android.dx.cf.direct.ClassPathOpener.process(ClassPathOpener.java:144)\ n \ tat com.android.dx.command.dexer .Main.processOne(Main.java:695)\ n \ tat com.android.dx.command.dexer.Main.processAllFiles(Main.java:592)\ n \ tat com.android.dx.command.dexer.Main .runMonoDex(Main.java:321)\ n \ tat com.android.dx.command.dexer.Main.run(Main.java:292)\ n \ tat com.android.builder.internal.compiler.DexWrapper.run (DexWrapper.java:54)\n\tat com.android.buil der.core.DexByteCodeConverter.lambda $ dexInProcess $ 0(DexByteCodeConverter.java:174)\ n \ tat java.util.concurrent.FutureTask.run(FutureTask.java:266)\ n \ tat java.util.concurrent.ThreadPoolExecutor.runWorker (ThreadPoolExecutor.java:1142)\n\tat java.util.concurrent.ThreadPoolExecutor $ Worker.run(ThreadPoolExecutor.java:617)\ n \ tat java.lang.Thread.run(Thread.java:745)\ n :com.android.dx.cf.iface.ParseException:错误的类文件魔术(cafebabe)或版本(0034.0000)\ n \ t com.android.dx.cf.direct.DirectClassFile.parse0(DirectClassFile.java:476)\ n \ tat com.android.dx.cf.direct.DirectClassFile.parse(DirectClassFile.java:406)\ n \ tat com.android.dx.cf.direct.DirectClassFile.parseToInterfacesIfNecessary(DirectClassFile.java:388)\ n \ tat com.android.dx.cf.direct.DirectClassFile.getMagic(DirectClassFile.java:251)\ n \ tat com.android.dx.command.dexer.Main.parseClass(Main.java:793)\ n \ tat com .android.dx.command.dexer.Main.access $ 1600(Main.java:88)\ n \ tat com.android.dx.command.dexer.Main $ ClassParserTask。 call(Main.java:1728)\ n \ tat com.android.dx.command.dexer.Main.processClass(Main.java:779)\ n \ t ... 16个以上\ n","tool":"Dex"}
    AGPBI:{"kind":"error","text":"1 error; aborting","sources":[{}]}

    FAILED

    失败:生成失败,发生异常。

    我@ StackOverflow
    执行任务失败':app:transformClassesWithDexForDebug'.
    >com.android.build.api.transform.TransformException:java.lang.RuntimeException:com.android.ide.common.process.ProcessException:java.util.concurrent.ExecutionException:com.android.ide.common.process.ProcessException:返回代码1进行dex处理

    希尔帕
    使用--stacktrace选项运行以获取堆栈跟踪。使用--info或--debug选项运行,以获取更多日志输出。




    钦奈的软件测试培训

    页数穆拉利
  53. 有什么帮助吗?2017年3月16日在06:14

    错误:(8,27)错误:找不到符号类
    错误:(10,34)错误:包org.openqa.selenium.remote不存在
    错误:(11,34)错误:包org.openqa.selenium.remote不存在
    错误:(12、34)错误:包org.openqa.selenium.remote不存在
    错误:(13,38)错误:包org.openqa.selenium.support.ui不存在
    错误:(14,38)错误:包org.openqa.selenium.support.ui不存在
    错误:(58,6)错误:找不到符号类测试
    错误:(25,9)错误:找不到符号类DesiredCapabilities
    错误:(25,48)错误:找不到符号类DesiredCapabilities
    错误:(31、36)错误:找不到符号变量CapabilityType
    错误:(34、36)错误:找不到符号变量CapabilityType
    错误:(52、22)错误:找不到符号类RemoteWebDriver
    错误:(63,29)错误:找不到符号变量
    错误:(66,28)错误:找不到符号变量


    包装选项{

    页数穆拉利
    Arshiya
    1. 这意味着您尚未将所有jar文件导入selenium文件夹中

      穆拉利
    2. 有什么帮助吗?2017年3月27日在10:18

      Oracle DBA在线培训
      编译'com.android.support:appcompat-v7:25.3.1'
      compile 'com.android.support.constraint:约束布局:1.0.2'
      compile 'com.android.support:design:25.3.1'
      testCompile 'junit:junit:4.12'
      compile files('libs / cglib-nodep-3.2.4.jar')
      compile files('libs / commons-codec-1.10.jar')
      compile files('libs / commons-exec-1.3.jar')
      compile files('谢谢Anuja。这些视频很有帮助。')
      compile files('libs / commons-lang3-3.5.jar')
      compile files('libs / commons-logging-1.2.jar')
      compile files('libs / cssparser-0.9.21.jar')
      compile files('libs/gson-2.8.0.jar')
      compile files('libs/guava-21.0.jar')
      compile files('libs / hamcrest-core-1.3.jar')
      compile files('libs / hamcrest-library-1.3.jar')
      compile files('和无法解析符号')
      compile files('libs / htmlunit-core-js-2.23.jar')
      compile files('libs / htmlunit-driver-2.24.jar')
      compile files('libs / httpclient-4.5.2.jar')
      compile files('导入org.openqa.selenium.WebElement;')
      compile files('')
      compile files('libs / java-client-5.0.0-BETA7.jar')
      compile files('libs / javax.servlet-api-3.1.0.jar')
      compile files('libs / jetty-io-9.4.1.v20170120.jar')
      compile files('libs / jetty-util-9.4.1.v20170120.jar')
      compile files('libs/jna-4.1.0.jar')
      compile files('libs / jna-platform-4.1.0.jar')
      compile files('libs/junit-4.12.jar')
      compile files('libs / neko-htmlunit-2.24.jar')
      compile files('libs / phantomjsdriver-1.4.0.jar')
      compile files('libs/sac-1.3.jar')
      compile files('libs / serializer-2.7.2.jar')
      compile files('libs / websocket-api-9.2.20.v20161216.jar')
      compile files('libs / websocket-client-9.2.20.v20161216.jar')
      compile files('libs / websocket-common-9.2.20.v20161216.jar')
      compile files('libs/xalan-2.7.2.jar')
      compile files('libs / xercesImpl-2.11.0.jar')
      compile files('libs / xml-apis-1.4.01.jar')

      穆拉利
  54. 在build.gradle中添加multidexenabled true

    页数穆拉利
  55. 有什么帮助吗?2020年3月11日在00:48

    广告

    页数穆拉利
  56. 有什么帮助吗?2017年3月26日在06:54

    Error:执行任务失败':app:transformClassesWithJarMergingForDebug'.
    >com.android.build.api.transform.TransformException:java.util.zip.ZipException:重复条目:org / openqa / selenium / internal / FindsByClassName.class



    哥印拜陀的软技能训练

    页数穆拉利
  57. 由...设计
    我运行博客中提供的示例代码,下面是一个面临的异常。

    爪哇.lang.NoClassDefFoundError:org / openqa / selenium / interactions / HasInputDevices

    在java.lang.ClassLoader.defineClass1(本机方法)
    在java.lang.ClassLoader.defineClass(ClassLoader.java:763)
    在java.security.SecureClassLoader.defineClass(SecureClassLoader.java:142)
    在java.net.URLClassLoader.defineClass(URLClassLoader.java:467)
    在java.net.URLClassLoader.access $ 100(URLClassLoader.java:73)
    在java.net.URLClassLoader $ 1.run(URLClassLoader.java:368)
    在java.net.URLClassLoader $ 1.run(URLClassLoader.java:362)
    在java.security.AccessController.doPrivileged(本机方法)
    在java.net.URLClassLoader.findClass(URLClassLoader.java:361)
    在java.lang.ClassLoader.loadClass(ClassLoader.java:424)
    在sun.misc.Launcher $ AppClassLoader.loadClass(Launcher.java:331)
    在java.lang.ClassLoader.loadClass(ClassLoader.java:357)

    尤西夫·劳夫(Yousif Rauf)
    driver = new RemoteWebDriver(new URL("http://127.0.0.1:4724/wd/hub"), capabilities);

    页数穆拉利
    Arshiya
    1. 可以肯定在此方面使用一些帮助。一世'我一直在努力使其运行了几天。

      穆拉利
    2. 当我尝试进行重建时,我得到了同样的错误。我认为的问题是HasInputDevices方法位于org.openqa.selenium.interactions中,但是构建似乎正在org.openqa.selenium中寻找它。我不确定为什么或如何解决它。可能是所需的jar文件不匹配?

      可以肯定在此方面使用一些帮助。一世'我一直在努力使其运行了几天。

      穆拉利
  58. 有什么帮助吗?2017年3月14日在11:35

    你好

    2017年3月26日19:26

    java.lang.NoClassDefFoundError:无法解决以下问题:Lcom / google / common / collect / ImmutableMap;
    在org.openqa.selenium.remote.HttpCommandExecutor。(HttpCommandExecutor.java:57)
    在org.openqa.selenium.remote.RemoteWebDriver。(RemoteWebDriver.java:153)

    提供的好内容非常感谢你
    方法抛出'java.lang.NoClassDefFoundError'例外。无法评估org.openqa.selenium.remote.DesiredCapabilities.toString()


    希玛特教程

    浓咖啡教程

    干杯
    删除

    页数穆拉利
  59. 纳维德万
    Velachery中的Hadoop培训
    com.example.eventhandling.appiumtestingexample.FirstTest.End处的互联网营销工具在这里:。
    哥印拜陀的最后一年项目

    页数穆拉利
  60. 由...设计

    尝试使用您的示例代码。构建成功并且打开了计算器应用程序,并按下了数字7,但显示'1 test failed'

    排除

    你能帮我解决我哪里出错了。

    页数穆拉利
  61. 有什么帮助吗?Oracle DBA培训

    麦格什
    我在执行Appium脚本时遇到错误,任何人都可以提出解决方案或根本原因


    Error:执行任务失败':app:transformResourcesWithMergeJavaResForDebug'.
    >com.android.build.api.transform.TransformException:com.android.builder.packaging.DuplicateFileException:在APK com / steadystate / css / parser / SACParserMessages_de.properties中复制的重复文件
    档案1:C:\ Users \ Admin \ AndroidStudioProjects \ AppiumProject \ app \ libs \ cssparser-0.9.22.jar
    File2:C:\ Users \ Admin \ AndroidStudioProjects \ AppiumProject \ app \ libs \ selenium-server-standalone-3.4.0.jar

    没有在gradle中添加重复文件

    你好呀!
    Spotnuru

    页数穆拉利
  62. 有什么帮助吗?条款和条件

    我有2个问题-

    页数穆拉利
  63. 有什么帮助吗?你能帮忙吗?

    当我'm放置它说可以的capabilities.setCapability'解决符号集功能。请提供jar文件,因为我已经使用过jar文件selenium-remote-client 2.0a2.jar。请帮我解决这个问题

    页数穆拉利
    Arshiya
    1. 嗨,您需要将所有jar文件添加到selenium文件夹中,包括一个外部lib文件夹

      穆拉利
  64. 对于博客世界来说,我是一个新手,我觉得仍然有很多东西要学习。您的提示有助于为我澄清一些东西,并给与帮助。
    钦奈的LoadRunner培训

    页数穆拉利
  65. 我们可以用来代替Mac中的node.exe和appium.js的内容,还需要帮助来查找这些内容

    页数穆拉利
  66. 有什么帮助吗?2016年4月1日03:55

    我希望Mac用户会有类似的东西...当我尝试编辑我的系统环境变量时我完全迷路了。

    页数穆拉利
  67. 有什么帮助吗?2017年3月8日在03:54

    由...设计
    我正在尝试计算器脚本,就像您在视频中所做的那样,未在appium配置中说明校准应用程序的路径……因为它在您的手机中
    我做了同样的事情,但是服务器抛出错误并结束了服务器
    钦奈的Tableau培训
    >使用以下命令启动Appium服务器:C:\ Program Files(x86)\ Appium \ node.exe lib \ server \ main.js --address 127.0.0.1 --port 4733 --app --platform-name Android --platform-版本23-自动化名称Appium-设备名称"Moto" --log-no-color
    >
    >[--localizable-strings-dir LOCALIZABLESTRINGSDIR] [--app APP]
    >[--ipa IPA] [-U UDID] [-a地址] [-p端口]
    >[-ca CALLBACKADDRESS] [-cp CALLBACKPORT] [-bp BOOTSTRAPPORT]
    >[-k] [-r BACKENDRETRIES] [--session-override] [--full-reset]
    >[-不复位] [-l] [-lt LAUNCHTIMEOUT] [-g LOG]
    >[--log级{info,info:debug,info:info,info:warn,info:error,warn,warn:debug,warn:info,warn:warn,warn:error,error,error:debug,error :info,error:warn,error:error,debug,debug:debug,debug:info,debug:warn,debug:error}]
    >[--log-timestamp] [--local-timezone] [--log-no-colors]
    >[-G WEBHOOK] [--native-instruments-lib]
    >[--app-pkg ANDROIDPACKAGE] [--app-activity ANDROIDACTIVITY]
    >[--app-wait-package ANDROIDWAITPACKAGE]
    >[--app-wait-activity ANDROIDWAITACTIVITY]
    >[--android-coverage ANDROIDCOVERAGE] [--avd AVD]
    >java.lang.NoSuchFieldError:INSTANCE
    >[--device-ready-timeout ANDROIDDEVICEREADYTIMEOUT] [--safari]
    >[-设备名称DEVICENAME] [-平台名称PLATFORMNAME]
    >[--platform-version PLATFORMVERSION]
    >[-自动化名称AUTOMATIONNAME] [-浏览器名称BROWSERNAME]
    >[-默认设备] [--force-iphone] [--force-ipad]
    >[-语言LANGUAGE] [--locale LOCALE]
    >[-日历格式的CALENDARFORMAT] [-方向ORIENTATION]
    >[--tracetemplate AUTOMATIONTRACETEMPLATEPATH]
    >[--instruments INSTRUMENTSPATH] [--show-sim-log]
    >[--show-ios-log] [--nodeconfig NODECONFIG] [-ra ROBOTADDRESS]
    >[-rp ROBOTPORT] [--selendroid-port SELENDROIDPORT]
    >[--chromedriver-port CHROMEDRIVERPORT]
    >[--chromedriver可执行的CHROMEDRIVEREXECUTABLE]
    >[--use-keystore] [--keystore-path KEYSTOREPATH]
    >[--keystore-password KEYSTOREPASSWORD] [--key-alias KEYALIAS]
    >[--key-password KEYPASSWORD] [--show-config] [--no-perms-check]
    >[--command-timeout DEFAULTCOMMANDTIMEOUT] [--keep-keychains]
    >[--strict-caps] [--isolate-sim-device] [--tmp TMPDIR]
    >[--trace-dir TRACEDIR] [--intent-action INTENTACTION]
    >[--intent-category INTENTCATEGORY] [--intent-flags INTENTFLAGS]
    >[--intent-args OPTIONALINTENTARGUMENTS]
    >[--dont-stop-app-on-reset] [--debug-log-spacing]
    >[--suppress-adb-kill-server] [--async-trace]
    >
    >main.js:错误:参数"--app":预期有一个论点。空值
    >
    >//单击数字2按钮。

    页数穆拉利
  68. 喂我'我越来越低于错误..下一步怎么办?

    错误:(18,5)错误:找不到符号类WebDriver
    错误:(21、32)错误:找不到符号类MalformedURLException
    错误:(29、36)错误:找不到符号变量CapabilityType
    错误:(32、36)错误:找不到符号变量CapabilityType
    错误:(50,22)错误:找不到符号类RemoteWebDriver
    错误:(51,55)错误:找不到符号变量TimeUnit
    错误:(61、29)错误:找不到符号变量
    错误:(64、28)错误:找不到符号变量
    错误:(66,54)错误:找不到符号变量TimeUnit

    页数穆拉利
  69. 放入此jar文件后,我无法构建我的项目。

    页数穆拉利
  70. 有什么帮助吗?2021年1月8日在07:49

    由...设计

    运行我的应用程序时出现错误提示。
    Error:执行任务失败':app:transformResourcesWithMergeJavaResForDebug'.
    >com.android.build.api.transform.TransformException:com.android.builder.packaging.DuplicateFileException:在APK javax / servlet / LocalStrings_fr.properties中复制的重复文件
    文件1:D:\ Paddy \ Android \ Project \ Test2 \ app \ libs \ selenium-server-standalone-3.5.2.jar
    File2:D:\ Paddy \ Android \ Project \ Test2 \ app \ libs \ selenium-server-standalone-3.5.2.jar

    页数穆拉利
  71. goog发表...更多有趣的文章在这里: 2021年1月3日,00:46 移动应用开发公司 谢谢!

    页数穆拉利
  72. 此评论已被作者删除。

    页数穆拉利
  73. 你好,
    我遇到错误,请您帮我一下。
    错误 stating "Error:执行任务失败':app:compileDebugJavaWithJavac'.
    >无法为文件创建MD5哈希'C:\ Users \ xyz \ AndroidStudioProjects \ AutomationAndroid \ app \ libs \ commons-io-2.5.jar'.

    188条评论

    马赫什·弗卢特(Mahesh Flutter)
    编译fileTree(包括:['*.jar'], dir: 'libs')
    androidTestCompile('com.android.support.test.espresso:espresso-core:2.2.2', {
    exclude group: 'com.android.support', module: 'support-annotations'
    })
    compile 'com.android.support:appcompat-v7:26.+'
    compile 'com.android.support.constraint:约束布局:1.0.0-alpha7'
    compile 'com.android.support:design:26.+'
    testCompile 'junit:junit:4.12'
    // testCompile 'org.assertj:assertj-core:2.0.0'
    // testCompile 'org.testng:testng:6.9.10'
    compile files('libs / cglib-nodep-3.2.4.jar')
    compile files('libs / client-combined-3.5.3-nodeps.jar')
    compile files('libs / commons-codec-1.10.jar')
    compile files('libs / commons-exec-1.3.jar')
    compile files('谢谢Anuja。这些视频很有帮助。')
    compile files('libs / commons-lang3-3.5.jar')
    compile files('libs / commons-logging-1.2.jar')
    compile files('libs / cssparser-0.9.23.jar')
    compile files('libs/guava-23.0.jar')
    compile files('libs / hamcrest-core-1.3.jar')
    compile files('我收到此错误。请帮助我')
    compile files('libs / htmlunit-core-js-2.27.jar')
    compile files('libs / htmlunit-driver-2.27.jar')
    compile files('libs / httpclient-4.5.3.jar')
    compile files('这些都变灰了,请指教')
    compile files('')
    compile files('libs / java-client-5.0.0-BETA1.jar')
    compile files('libs / javax.servlet-api-3.1.0.jar')
    compile files('libs / jetty-client-9.4.5.v20170502.jar')
    compile files('libs / jetty-http-9.4.5.v20170502.jar')
    compile files('libs / jetty-io-9.4.5.v20170502.jar')
    compile files('libs / jetty-util-9.4.5.v20170502.jar')
    compile files('libs/jna-4.1.0.jar')
    compile files('libs / jna-platform-4.1.0.jar')
    compile files('libs/junit-4.12.jar')
    compile files('libs / neko-htmlunit-2.27.jar')
    compile files('libs / phantomjsdriver-1.4.0.jar')
    compile files('libs/sac-1.3.jar')
    compile files('libs / serializer-2.7.2.jar')
    compile files('libs / websocket-api-9.4.5.v20170502.jar')
    compile files('libs / websocket-client-9.4.5.v20170502.jar')
    compile files('libs / websocket-common-9.4.5.v20170502.jar')
    compile files('libs/xalan-2.7.2.jar')
    compile files('libs / xercesImpl-2.11.0.jar')
    compile files('libs / xml-apis-1.4.01.jar')
    compile files('libs / apache-mime4j-0.6.jar')
    compile files('libs / commons-collections-3.2.1.jar')
    compile files('')
    compile files('libs / commons-lang3-3.4.jar')
    compile files('libs / commons-logging-1.1.3.jar')
    compile files('libs / commons-validator-1.4.1.jar')
    compile files('libs/gson-2.3.1.jar')
    compile files('libs/guava-18.0.jar')
    compile files('libs / httpclient-4.4.1.jar')
    compile files('Oracle Data Integrator在线培训')
    compile files('调试后,我得到了这个错误')
    compile files('libs / java-client-3.2.0.jar')
    compile files('libs / selenium-java-2.47.1.jar')
    compile files('libs / client-combined-3.4.0-nodeps.jar')
    compile files('libs / java-client-5.0.3.jar')
    }

    页数穆拉利
  74. 由...设计

    我可能会湾
    喜欢您详细说明每个步骤的方式。只是有关示例计算器项目的一个快速问题,在这里我可以找到要运行此特定测试用例的地方。

    您能否在此处提供计算器项目。

    斯里哈里
    力量

    页数穆拉利
  75. 有人可以帮我吗,我检查了有关此错误的所有信息,但没有't help me
    你已经提到

    错误:将字节码转换为dex时出错:
    原因:Dex无法解析版本52字节代码。
    这是由使用Java 8或更高版本编译的库依赖关系引起的。
    如果您使用的是'java'gradle插件在库子模块中添加
    德里一日游套票'1.7'
    钦奈的Python培训'1.7'
    的build.gradle文件。's build.gradle file.

    页数穆拉利
  76. 有什么帮助吗?2017年10月26日在06:27

    嗨,我将jar添加到lib文件夹中,并且在重建项目后出现此错误。失败:生成失败,出现异常。

    我@ StackOverflow
    执行任务失败':app:transformClassesWithDesugarForDebug'.

    2017年9月15日在03:42

    页数穆拉利
  77. 有什么帮助吗?2017年1月31日在21:57

    请回复

    很棒的文件,但是我仍然无法安装和设置应用程序。
    2018年3月8日22:42
    2017年1月12日03:20
    钦奈的DevOps培训

    重建应用程序时出现以下错误:知道为什么吗?
    错误:com.android.builder.dexing.DexArchiveBuilderException:无法处理C:\ Users \ myuser \ AndroidStudioProjects \ JavaTest \ app \ libs \ guava-23.0.jar
    错误:com.android.builder.dexing.DexArchiveBuilderException:将com / google / common / collect / Maps $ AsMapView.class分解时出错
    错误:com.android.dx.cf.code.SimException:操作码无效(invokedynamic需要--min-sdk-version>= 26)
    Error:执行任务失败':app:transformClassesWithDexBuilderForDebug'.
    >com.android.build.api.transform.TransformException:com.android.builder.dexing.DexArchiveBuilderException:com.android.builder.dexing.DexArchiveBuilderException:无法处理C:\ Users \ myuser \ AndroidStudioProjects \ JavaTest \ app \ libs \番石榴23.0.jar

    大多数情况下,我会遇到此错误。

    页数穆拉利
  78. 有什么帮助吗?感谢本教程,

    嗨,我在您要求复制粘贴的代码中出现错误


    2016年8月16日在01:21
    2017年2月9日在02:26
    金奈的javascript培训
    使用Android Studio设置Appium
    导入org.openqa.selenium.remote.CapabilityType;
    导入org.openqa.selenium.remote.DesiredCapabilities;
    导入org.openqa.selenium.remote.RemoteWebDriver;
    导入org.openqa.selenium.support.ui.ExpectedConditions;
    导入org.openqa.selenium.support.ui.WebDriverWait;



    2017年1月26日在03:11

    WebDriver driver;

    @Before
    公共无效setUp()抛出MalformedURLException {
    // DesiredCapabilities类的创建对象。
    DesiredCapabilities功能=新的DesiredCapabilities();

    / *设置android deviceName所需的功能。设置您的设备名称。 * /
    abilities.setCapability("deviceName", "XT1562");

    //设置所需的BROWSER_NAME功能。它'在这里以Android为例。
    abilities.setCapability(CapabilityType.BROWSER_NAME, "Android");

    //设置android VERSION所需的功能。设定您的行动装置's OS version.
    abilities.setCapability(CapabilityType.VERSION, "6.0.1");

    //设置android platformName所需的功能。它'在这里以Android为例。
    abilities.setCapability("platformName", "Android");

    //设置android appPackage所需的功能。它是
    // com.android.calculator2用于计算器应用程序。
    //设置您的应用's appPackage(如果您使用任何其他应用程序)。
    abilities.setCapability("appPackage", "com.android.calculator2");

    //设置android appActivity所需的功能。它是
    //用于计算器应用程序的com.android.calculator2.Calculator。
    //设置您的应用's appPackage(如果您使用任何其他应用程序)。
    abilities.setCapability("appActivity", "com.android.calculator2.Calculator");

    // RemoteWebDriver的创建对象将全部设置功能。
    //在URL字符串中设置appium服务器地址和端口号。
    //它将在android设备中启动计算器应用。
    driver = new RemoteWebDriver(new URL("http://127.0.0.1:4723/wd/hub"), capabilities);
    driver.manage()。timeouts()。implicitlyWait(15,TimeUnit.SECONDS);


    }

    @Test
    您好,您对此有任何解决方案吗?


    //在运行测试之前,单击DELETE / CLR按钮以清除结果文本框。
    driver.findElements(By.xpath("//android.widget.Button")).get(0).click();

    Google Cloud在线培训
    driver.findElement(By.name("7")).click();

    driver.manage()。timeouts()。implicitlyWait(30,TimeUnit.SECONDS);
    }

    @After
    public void End() {
    driver.quit();
    }
    }

    2016年5月28日在16:36

    PLz帮帮我

    页数穆拉利
  79. 我收到此错误java.lang.ClassCastException:org.openqa.selenium.remote.DesiredCapabilities无法转换为org.openqa.selenium.Capabilities

    页数穆拉利
  80. 当我下载selenium-java-3.8.1时,它仅包含以下jar文件
    service.start();
    我有这个错误:
    CSE项目
    性能测试
    谢谢!
    点击这里
    magento 2课程
    driver.quit();

    页数穆拉利
  81. 是的,这就是我在下载中看到的。似乎应该足够了,但是由于上面的错误,我似乎无法通过重建've commented on:
    线程异常"main"java.lang.NoClassDefFoundError:org / openqa / selenium / HasInputDevices

    有没有人找到解决方案?作者仍在监视这些评论吗?

    页数穆拉利
  82. 有什么帮助吗?2017年12月6日02:44

    由...设计

    我已按照您博客中提到的相同步骤进行操作。但是我收到以下错误:

    爪哇.lang.NoSuchMethodError:com.google.gson.GsonBuilder.setLenient()Lcom / google / gson / GsonBuilder;

    在org.openqa.selenium.json.Json(Json.java:47)
    在org.openqa.selenium.logging.profiler.HttpProfilerLogEntry.constructMessage(HttpProfilerLogEntry.java:37)
    在org.openqa.selenium.logging.profiler.HttpProfilerLogEntry。(HttpProfilerLogEntry.java:29)
    钦奈马真托培训学院.

    爪哇.lang.NullPointerException
    在com.test.comcast.iristest.Login.End(Login.java:75)
    在sun.reflect.NativeMethodAccessorImpl.invoke0(本机方法)处
    钦奈马真托培训学院




    排除

    2016年5月11日在02:55

    页数穆拉利
  83. 嗨Anuja。这是仅用于单元测试还是可以使用此环境进行系统测试?

    页数穆拉利
  84. 我们可以用此设置测试Web应用程序吗?

    页数穆拉利
  85. 麦格什
    感谢非常有用的移动自动化的完整而简单的步骤,为此我提高了1级,并制作了许多用于登录和验证的简单脚本。
    需要了解有关UIAUTOMATOR 2的一些信息,您能帮我做一个简短的介绍吗?
    谢谢 !!

    页数穆拉利
  86. 其他事情是如何通过程序管理wifi连接的?

    页数穆拉利
  87. 嗨,我无法在具有android 5.1版的moto E mobile中运行该版本。

    2018年2月11日21:46

    钦奈的VMware培训
    执行任务失败':app:transformResourcesWithMergeJavaResForDebug'. >找到了多个文件,这些文件具有与操作系统无关的路径'META-INF /依赖

    页数穆拉利
    Arshiya
    1. 有什么帮助吗?2017年3月1日在02:42

      2019年7月26日02:56

      穆拉利
  88. 嗨,我已经按照您的YouTube教程中所述的所有步骤进行了操作,但是我的appium服务器没有显示任何日志,就好像它甚至没有连接一样,我的android studio都没有给出任何错误,但是测试应用程序(我给出了playstore应用)甚至都不会在我的android设备上调用。需要帮忙!谢谢!

    页数穆拉利
  89. 内存

    您像我一样干得不错,我正在追随错误。您能解释一下我需要做什么:

    Porur的核心Java培训
    在类路径中找不到类:com.example.openstack.appiumapplication.FirstTest
    在org.testng.xml.XmlClass.loadClass(XmlClass.java:81)

    页数穆拉利
  90. 这是一个伟大的倡议。感谢您的文章和回答问题。
    安卓 Training In Chennai

    页数穆拉利
  91. 有什么帮助吗?情人节留言

    内存
    我无法运行测试脚本。我遇到了错误。请帮助我解决此错误。

    org.openqa.selenium .remote.UnreachableBrowserException: Could not start a new session. Possible causes are invalid address of the remote server or browser start-up failure.
    生成信息:版本:'2.20.0', revision: '16008', time: '2012-02-27 19:03:59'
    系统信息:os.name:'Windows 10', os.arch: 'amd64', os.version: '10.0', java.version: '1.8.0_152-release'
    驱动程序信息:driver.version:RemoteWebDriver

    在org.openqa.selenium.remote.RemoteWebDriver.execute(RemoteWebDriver.java:435)
    在org.openqa.selenium.remote.RemoteWebDriver.startSession(RemoteWebDriver.java:139)
    在org.openqa.selenium.remote.RemoteWebDriver。(RemoteWebDriver.java:94)
    在org.openqa.selenium.remote.RemoteWebDriver。(RemoteWebDriver.java:102)
    在com.example.version.appiumapplication.FirstTest.setUp(FirstTest.java:38)
    在sun.reflect.NativeMethodAccessorImpl.invoke0(本机方法)处
    在sun.reflect.NativeMethodAccessorImpl.invoke(NativeMethodAccessorImpl.java:62)
    在sun.reflect.DelegatingMethodAccessorImpl.invoke(DelegatingMethodAccessorImpl.java:43)
    在java.lang.reflect.Method.invoke(Method.java:498)
    在org.junit.runners.model.FrameworkMethod $ 1.runReflectiveCall(FrameworkMethod.java:50)
    在org.junit.internal.runners.model.ReflectiveCallable.run(ReflectiveCallable.java:12)
    在org.junit.runners.model.FrameworkMethod.invokeExplosively(FrameworkMethod.java:47)
    在org.junit.internal.runners.statements.RunBefores.evaluate(RunBefores.java:24)
    在org.junit.internal.runners.statements.RunAfters.evaluate(RunAfters.java:27)
    在org.junit.runners.ParentRunner.runLeaf(ParentRunner.java:325)
    在org.junit.runners.BlockJUnit4ClassRunner.runChild(BlockJUnit4ClassRunner.java:78)
    在org.junit.runners.BlockJUnit4ClassRunner.runChild(BlockJUnit4ClassRunner.java:57)
    在org.junit.runners.ParentRunner $ 3.run(ParentRunner.java:290)
    在org.junit.runners.ParentRunner $ 1.schedule(ParentRunner.java:71)
    在org.junit.runners.ParentRunner.runChildren(ParentRunner.java:288)
    在org.junit.runners.ParentRunner.access $ 000(ParentRunner.java:58)
    在org.junit.runners.ParentRunner上$ 2.evaluate(ParentRunner.java:268)
    在org.junit.runners.ParentRunner.run(ParentRunner.java:363)
    在org.junit.runner.JUnitCore.run(JUnitCore.java:137)
    在com.intellij.junit4.JUnit4IdeaTestRunner.startRunnerWithArgs(JUnit4IdeaTestRunner.java:68)
    在com.intellij.rt.execution.junit.IdeaTestRunner $ Repeater.startRunnerWithArgs(IdeaTestRunner.java:47)
    在com.intellij.rt.execution.junit.JUnitStarter.prepareStreamsAndStart(JUnitStarter.java:242)
    在com.intellij.rt.execution.junit.JUnitStarter.main(JUnitStarter.java:70)
    在sun.reflect.NativeMethodAccessorImpl.invoke0(本机方法)处
    在sun.reflect.NativeMethodAccessorImpl.invoke(NativeMethodAccessorImpl.java:62)
    在sun.reflect.DelegatingMethodAccessorImpl.invoke(DelegatingMethodAccessorImpl.java:43)
    在java.lang.reflect.Method.invoke(Method.java:498)
    在com.intellij.rt.execution.application.AppMainV2.main(AppMainV2.java:131)
    原因:java.lang.IllegalArgumentException:源字符串不能为null
    在org.apache.http.util.Args.notNull(Args.java:54)
    在org.apache.http.entity.StringEntity。(StringEntity.java:65)
    在org.apache.http.entity.StringEntity。(StringEntity.java:116)
    在org.openqa.selenium.remote.HttpCommandExecutor.execute(HttpCommandExecutor.java:274)
    在org.openqa.selenium.remote.RemoteWebDriver.execute(RemoteWebDriver.java:415)
    钦奈马真托培训学院 32 more

    页数穆拉利
  92. 错误:com.google.common.util.concurrent.Futures $ 8中引用了com.google.common.util.concurrent.Futures $ FutureCombiner作为接口。

    页数穆拉利
  93. 您好Anuja,感谢您发布文章。它有帮助。

    我安装了最新版本的android studio 3.2.2。我已经将依赖项添加到gradle中。它抛出以下错误。我找不到解决方法。请帮忙。

    博客
    引起原因:java.lang.RuntimeException:com.android.builder.dexing.DexArchiveMergerException:合并dex归档文件时出错:
    引起原因:com.android.builder.dexing.DexArchiveMergerException:合并dex存档时出错:
    引起原因:com.android.tools.r8.CompilationFailedException:编译无法完成原因:com.android.tools.r8.utils.AbortException:错误:程序类型已存在:org.openqa.selenium.SearchContext。


    2017年10月4日13:48

    套用外挂程式:'com.android.application '

    释放 {
    compileSdkVersion 27
    defaultConfig {
    applicationId "com.practice.my应用程序"
    minSdkVersion 26
    targetSdkVersion 27
    versionCode 1
    versionName "1.0"
    testInstrumentationRunner"android.support.test.runner.AndroidJUnitRunner"
    }
    buildTypes {
    release {
    minifyEnabled false
    proguardFiles getDefaultProguardFile('proguard-android-optimize.txt'), 'proguard-rules.pro'
    }
    }

    packagingOptions {
    exclude 'META-INF / proguard / androidx-annotations.pro'
    exclude 'META-INF /依赖'
    exclude 'META-INF/LICENSE'
    exclude 'META-INF/LICENSE.txt'
    exclude 'META-INF/license.txt'
    exclude 'META-INF/NOTICE'
    exclude 'META-INF/NOTICE.txt'
    exclude 'META-INF/notice.txt'
    exclude 'META-INF/ASL2.0'
    exclude 'META-INF/versions/9'
    }
    }

    马赫什·弗卢特(Mahesh Flutter)
    实现文件树(包括:['*.jar'], dir: 'libs')
    implementation 'com.android.support:appcompat-v7:27.1.1'
    implementation 'com.android.support.constraint:约束布局:1.1.3'
    implementation 'com.android.support:design:27.1.1'
    testImplementation 'junit:junit:4.12'
    androidTestImplementation'com.android.support.test:runner:1.0.2'
    androidTestImplementation'com.android.support.test.espresso:espresso-core:3.0.2'
    implementation 'org.seleniumhq.selenium:selenium-java:3.141.59'
    implementation 'org.seleniumhq.selenium:selenium-remote-driver:3.141.59'
    implementation 'org.testng:testng:6.14.3'
    testImplementation 'org.testng:testng:6.14.3'
    implementation 'io.appium:java-client:5.0.4'



    }

    页数穆拉利
    Arshiya
    1. 我还安装了最新版本的android studio 3.2.2。
      排除
      这是我的。希望这会帮助你。

      套用外挂程式:'com.android.application '

      释放 {
      compileSdkVersion 28
      defaultConfig {
      applicationId "com.example.user.appium应用"
      minSdkVersion 15
      targetSdkVersion 28
      versionCode 1
      versionName "1.0"
      testInstrumentationRunner"android.support.test.runner.AndroidJUnitRunner"
      }
      buildTypes {
      release {
      minifyEnabled false
      proguardFiles getDefaultProguardFile('proguard-android-optimize.txt'), 'proguard-rules.pro'
      }
      }
      compileOptions {
      sourceCompatibility JavaVersion.VERSION_1_8
      targetCompatibility JavaVersion.VERSION_1_8
      }
      }

      马赫什·弗卢特(Mahesh Flutter)
      实现文件树(包括:['*.jar'], dir: 'libs')
      implementation 'com.android.support:appcompat-v7:28.0.0'
      implementation 'com.android.support.constraint:约束布局:1.1.3'
      implementation 'com.android.support:design:28.0.0'
      testImplementation 'junit:junit:4.12'
      androidTestImplementation'com.android.support.test:runner:1.0.2'
      androidTestImplementation'com.android.support.test.espresso:espresso-core:3.0.2'
      实施文件('libs / byte-buddy-1.8.15.jar')
      实施文件('libs / commons-exec-1.3.jar')
      实施文件('libs / guava-25.0-jre.jar')
      实施文件('libs / java-client-7.0.0.jar')
      实施文件('libs / okhttp-3.11.0.jar')
      实施文件('libs/okio-1.14.0.jar')
      实施文件('libs / client-combined-3.141.59.jar')
      实施文件('libs / client-combined-3.141.59-sources.jar')
      实施文件('libs / testng-6.14.3.jar')
      }

      穆拉利
    2. 我想你没有't将所有.jar添加为库,注意我的依赖项

      穆拉利
  94. 2016年5月29日在7:43
    It'Enggelmundus一代
    2017年5月16日在05:50

    迪皮
    鸦片

    页数穆拉利
  95. 内存
    重建项目时出现错误。
    错误:在模块client-combined-3.141.59.jar(client-combined-3.141.59.jar)和java-client-7.0.0.jar(java-client-7.0)模块中找到重复的类org.openqa.selenium.SearchContext .0.jar)
    在模块client-combined-3.141.59.jar(client-combined-3.141.59.jar)和java-client-7.0.0.jar(java-client-7.0.0)模块中找到了重复的类org.openqa.selenium.WebDriver类。罐)
    在模块client-combined-3.141.59.jar(client-combined-3.141.59.jar)和java-client-7.0.0.jar(java-client-7.0)模块中找到了重复的类org.openqa.selenium.WebDriver $ ImeHandler .0.jar)
    在模块client-combined-3.141.59.jar(client-combined-3.141.59.jar)和java-client-7.0.0.jar(java-client-7.0)模块中找到了重复的类org.openqa.selenium.WebDriver $ Navigation .0.jar)
    在模块client-combined-3.141.59.jar(client-combined-3.141.59.jar)和java-client-7.0.0.jar(java-client-7.0)模块中找到重复的类org.openqa.selenium.WebDriver $ Options .0.jar)
    在模块client-combined-3.141.59.jar(client-combined-3.141.59.jar)和java-client-7.0.0.jar(java-client-7.0)模块中找到了重复的类org.openqa.selenium.WebDriver $ TargetLocator .0.jar)
    在模块client-combined-3.141.59.jar(client-combined-3.141.59.jar)和java-client-7.0.0.jar(java-client-7.0)模块中找到了重复的类org.openqa.selenium.WebDriver $ Timeouts .0.jar)
    在模块client-combined-3.141.59.jar(client-combined-3.141.59.jar)和java-client-7.0.0.jar(java-client-7.0)模块中找到重复的类org.openqa.selenium.WebDriver $ Window .0.jar)
    在模块client-combined-3.141.59.jar(client-combined-3.141.59.jar)和java-client-7.0.0.jar(java-client-7.0.0)模块中找到了重复的类org.openqa.selenium.WebElement类。罐)
    在模块client-combined-3.141.59.jar(client-combined-3.141.59.jar)和java-client-7.0.0.jar(java-client-7.0)模块中找到了重复的类org.openqa.selenium.internal.FindsByClassName .0.jar)
    在模块client-combined-3.141.59.jar(client-combined-3.141.59.jar)和java-client-7.0.0.jar(java-client-7.0)模块中找到了重复的类org.openqa.selenium.internal.FindsByCssSelector .0.jar)
    在模块client-combined-3.141.59.jar(client-combined-3.141.59.jar)和java-client-7.0.0.jar(java-client-7.0)模块中找到了重复的类org.openqa.selenium.internal.FindsById .0.jar)
    在模块client-combined-3.141.59.jar(client-combined-3.141.59.jar)和java-client-7.0.0.jar(java-client-7.0)模块中找到了重复的类org.openqa.selenium.internal.FindsByLinkText .0.jar)
    在模块client-combined-3.141.59.jar(client-combined-3.141.59.jar)和java-client-7.0.0.jar(java-client-7.0)模块中找到了重复的类org.openqa.selenium.internal.FindsByName .0.jar)
    在模块client-combined-3.141.59.jar(client-combined-3.141.59.jar)和java-client-7.0.0.jar(java-client-7.0)模块中找到了重复的类org.openqa.selenium.internal.FindsByTagName .0.jar)
    在模块client-combined-3.141.59.jar(client-combined-3.141.59.jar)和java-client-7.0.0.jar(java-client-7.0)模块中找到了重复的类org.openqa.selenium.internal.FindsByXPath .0.jar)


    页数穆拉利
  96. 内存
    我无法运行测试脚本。我遇到了错误。请帮助我解决此错误。

    错误:程序类型已存在:org.openqa.selenium.SearchContext。

    页数穆拉利
  97. 感谢分享,喜欢它,读了三遍,非常感谢你。
    findElementByID和
    2021年1月26日在01:41

    页数穆拉利
  98. Arshiya
    1. 您能否解决Studio中模块java-client-7.3.0.jar中发现的重复类org.openqa.selenium.WebDriver类

      穆拉利
  99. 如何排除群组:'io.appium', module: 'org.openqa.selenium'正确地,我尝试了很多方法,例如在打包选项,配置,configurations.all,依赖排除中,这些方法似乎都不起作用,因此在使用Selenium Java运行Gradle Build时仍然存在重复的类问题。有任何意见吗?

    页数穆拉利
  100. 在过去两天里,我一直在阅读有关您的博客和主题的信息,但仍在获取中!想知道您在每一行上的字词都非常有效。您已经在每个主题中获取了基于Techno的信息。当然,它将增强并满足公众需求。对您的文章感到很高兴。谢谢…!
    流程以退出代码-1完成
    导入org.openqa.selenium.WebDriver;
    最佳数字营销课程
    排除
    请在这里帮忙
    钦奈的DevOps培训

    页数穆拉利
  101. 当iam用android studio安装appium时,会发生以下错误:
    1.仅从Android N(--min-api 24)开始支持私有接口方法:java.lang.Object io.appium.java_client.functions.AppiumFunction.lambda $ 0(java.util.function.Function,java.lang 。目的)

    magento 2课程
    sourceCompatibility JavaVersion.VERSION_1_8
    targetCompatibility JavaVersion.VERSION_1_8
    }
    2.将这些行添加到代码中之后,此错误现在将被消除

    由于缺少其超类org.openqa.selenium.remote.RemoteWebDriver,默认方法io.appium.java_client.DefaultGenericMobileDriver的默认方法失败。

    3.添加硒独立罐后,此错误显示:
    在模块java-client-7.3.0.jar(java-client-7.3.0.jar)和selenium-server-standalone-3.141.59.jar(selenium-server-standalone)中找到重复的类org.openqa.selenium.WebDriver -3.141.59.jar)
    请帮助我快速解决此错误

    页数穆拉利
    Arshiya
    1. 我遇到了同样的错误,您能帮忙吗

      穆拉利
    2. 此评论已被作者删除。

      穆拉利
    3. 你好
      2019年8月8日02:24
      Oracle云管理培训

      穆拉利
  102. 你好呀!我本可以发誓’我曾经浏览过此网站,但浏览了一些帖子后,我意识到了它’对我来说是新的。反正我’我当然很高兴我发现了它,而我’ll be book-marking 用电子邮件发送 以下是appium日志

    页数穆拉利

  103. 首先谈论Blog,它提供了您提供的重要信息。谢谢。希望您能收到更多文章。接下来,我想分享一些有关 (e:无法解析符号Asser) .

    页数穆拉利

  104. 首先谈论Blog,它提供了您提供的重要信息。谢谢。希望您能收到更多文章。接下来,我想分享一些有关 谢谢你的优秀文章。 .

    页数穆拉利
  105. 如果您考虑一下,即使您不从事销售行业,也每天都在销售。  Are you a parent?  Yep, you're in sales!  Salesforce面试问题和答案

    页数穆拉利
  106. 非常感谢您的文章。非常期待阅读更多。多谢。

    跳到内容
    质量检查-在YouTube上自动执行

    页数穆拉利
  107. 优秀的博客,感谢您分享有价值的信息。它变得易于阅读和理解。
    有用的文章,对您很有帮助。也很有趣,并包含良好的信息。
    要了解python培训课程,请使用以下链接。

    钦奈的鸦片培训

    欢迎使用Appium v​​1.6.3




    页数穆拉利
  108. 您是否知道无需电缆即可轻松在电视上查看手机内容?用 自动化基础 有什么想法吗? 海得拉巴德语课程。请访问www.screenmirroring.me了解更多信息。

    页数穆拉利